Chat APIs and In-app Messaging SDKs for Developers, by Developers

Applozic powers multi-platform Chat APIs and in-app Messaging SDKs for Android, iOS and the Web that will enable you to build advanced in-app chat solutions your users will love.

Integrate chat in your application with completely customizable UI kits, powerful messaging APIs and SDKs, developed with exceptional security measures in mind.

Documentation    API Explorer

Questions

Ask A Question
2
ANSWERED

NativeScript : Error: Command gradlew.bat failed with exit code 1

Hi, I try to use Applozic Framework in nativeScript Application but when I add the plugin. I cannot deploy my app and i get this error. Can you help me ? Failed to build plugin nativescript-applozic-chat : Error: Command gradlew.bat failed with exit code 1 Error output: C:\Users\gvialon\.gradle\caches\transforms-1\files-1.1\appcompat-v7-27.1.1.aar\0fada22f7b54b53e28ddb56c250376b3\res\values-v26\values-v26.xml:9:5-12:13: AAPT: error: resource android:attr/colorError not found. C:\Users\gvialon\.gradle\caches\transforms-1\files-1.1\appcompat-v7-27.1.1.aar\0fada22f7b54b53e28ddb56c250376b3\res\values-v26\values-v26.xml:13:5-16:13: AAPT: error: resource android:attr/colorError not found. C:\Users\gvialon\.gradle\caches\transforms-1\files-1.1\design-27.1.1.aar\45c15dc357b97519536239d227c24459\res\values-v26\values-v26.xml:3:5-6:13: AAPT: error: style attribute 'android:attr/keyboardNavigationCluster' not found. C:\Users\gvialon\.gradle\caches\transforms-1\files-1.1\appcompat-v7-27.1.1.aar\0fada22f7b54b53e28ddb56c250376b3\res\values-v26\values-v26.xml:17:5-93: AAPT: error: style attribute 'android:attr/keyboardNavigationCluster' not found. C:\Users\gvialon\.gradle\caches\transforms-1\files-1.1\appcompat-v7-27.1.1.aar\0fada22f7b54b53e28ddb56c250376b3\res\values\values.xml:251:5-69: AAPT: error: resource android:attr/keyboardNavigationCluster not found. C:\Users\gvialon\.gradle\caches\transforms-1\files-1.1\appcompat-v7-27.1.1.aar\0fada22f7b54b53e28ddb56c250376b3\res\values\values.xml:251:5-69: AAPT: error: resource android:attr/fontStyle not found. C:\Users\gvialon\.gradle\caches\transforms-1\files-1.1\appcompat-v7-27.1.1.aar\0fada22f7b54b53e28ddb56c250376b3\res\values\values.xml:251:5-69: AAPT: error: resource android:attr/font not found. C:\Users\gvialon\.gradle\caches\transforms-1\files-1.1\appcompat-v7-27.1.1.aar\0fada22f7b54b53e28ddb56c250376b3\res\values\values.xml:251:5-69: AAPT: error: resource android:attr/fontWeight not found. FAILURE: Build failed with an exception. * What went wrong: Execution failed for task ':verifyReleaseResources'. > com.android.ide.common.process.ProcessException: Failed to execute aapt * Try: Run with --stacktrace option to get the stack trace. Run with --info or --debug option to get more log output. Run with --scan to get full insights. * Get more help at https://help.gradle.org BUILD FAILED in 4m 16s

Posted by Gaetan Vialon 3 years ago